Target
Prostacyclin receptor
Ligand
BDBM50169552
Substrate
Meas. Tech.
ChEMBL_1578427 (CHEMBL3808244)
EC50
11±n/a nM
Citation
 Ogawa, SWatanabe, TSugimoto, IMoriyuki, KGoto, YYamane, SWatanabe, ATsuboi, KKinoshita, AKigoshi, HTani, KMaruyama, T Discovery of G Protein-Biased EP2 Receptor Agonists. ACS Med Chem Lett 7:306-11 (2016)  
Target
Name:
Prostacyclin receptor
Synonyms:
PGI receptor PRIPR Prostacyclin (IP) Receptor Prostaglandin I Prostaglandin I2 receptor | Prostanoid IP receptor
Type:
G Protein-Coupled Receptor (GPCR)
Mol. Mass.:
40968.22
Organism:
Homo sapiens (Human)
Description:
The membranes prepared from human platelet were used in binding assay.
Residue:
386
  
Inhibitor
Name:
BDBM50169552
Synonyms:
CHEMBL3804978
Type:
Small organic molecule
Emp. Form.:
C22H25NO6S
Mol. Mass.:
431.502
SMILES:
[H][C@]12C[C@@H](O)[C@H](\C=C\[C@@H](O)COc3ccccc3)[C@@]1([H])CC[C@@H](O2)c1nc(cs1)C(O)=O
: