Target
Prostaglandin E2 receptor EP2 subtype
Ligand
BDBM50169611
Substrate
Meas. Tech.
ChEMBL_1578425 (CHEMBL3808242)
EC50
3.6±n/a nM
Citation
 Ogawa, SWatanabe, TSugimoto, IMoriyuki, KGoto, YYamane, SWatanabe, ATsuboi, KKinoshita, AKigoshi, HTani, KMaruyama, T Discovery of G Protein-Biased EP2 Receptor Agonists. ACS Med Chem Lett 7:306-11 (2016)  
Target
Name:
Prostaglandin E2 receptor EP2 subtype
Synonyms:
PE2R2_HUMAN PTGER2 Prostaglandin E2 receptor Prostanoid EP2 Receptor
Type:
Enzyme
Mol. Mass.:
39775.71
Organism:
Homo sapiens (Human)
Description:
P43116
Residue:
358
  
Inhibitor
Name:
BDBM50169611
Synonyms:
CHEMBL3805554
Type:
Small organic molecule
Emp. Form.:
C20H23NO5S
Mol. Mass.:
389.465
SMILES:
[H][C@]12C[C@@H](O)[C@H](COc3cccc(C)c3)[C@@]1([H])CC[C@@H](O2)c1nc(cs1)C(O)=O
: