Target
Prostaglandin E2 receptor EP2 subtype
Ligand
BDBM50156542
Substrate
Meas. Tech.
ChEMBL_1578429 (CHEMBL3808246)
EC50
>10000±n/a nM
Citation
 Ogawa, SWatanabe, TSugimoto, IMoriyuki, KGoto, YYamane, SWatanabe, ATsuboi, KKinoshita, AKigoshi, HTani, KMaruyama, T Discovery of G Protein-Biased EP2 Receptor Agonists. ACS Med Chem Lett 7:306-11 (2016)  
Target
Name:
Prostaglandin E2 receptor EP2 subtype
Synonyms:
PE2R2_HUMAN PTGER2 Prostaglandin E2 receptor Prostanoid EP2 Receptor
Type:
Enzyme
Mol. Mass.:
39775.71
Organism:
Homo sapiens (Human)
Description:
P43116
Residue:
358
  
Inhibitor
Name:
BDBM50156542
Synonyms:
CHEMBL3793786
Type:
Small organic molecule
Emp. Form.:
C19H20ClNO5S
Mol. Mass.:
409.884
SMILES:
[H][C@]12C[C@@H](O)[C@H](COc3ccc(Cl)cc3)[C@@]1([H])CC[C@@H](O2)c1nc(cs1)C(O)=O
: