Target
Insulin-like growth factor 1 receptor
Ligand
BDBM158155
Substrate
Meas. Tech.
ChEMBL_1577152 (CHEMBL3807414)
IC50
1441±n/a nM
Citation
 Menichincheri, MArdini, EMagnaghi, PAvanzi, NBanfi, PBossi, RBuffa, LCanevari, GCeriani, LColombo, MCorti, LDonati, DFasolini, MFelder, EFiorelli, CFiorentini, FGalvani, AIsacchi, ABorgia, ALMarchionni, CNesi, MOrrenius, CPanzeri, APesenti, ERusconi, LSaccardo, MBVanotti, EPerrone, EOrsini, P Discovery of Entrectinib: A New 3-Aminoindazole As a Potent Anaplastic Lymphoma Kinase (ALK), c-ros Oncogene 1 Kinase (ROS1), and Pan-Tropomyosin Receptor Kinases (Pan-TRKs) inhibitor. J Med Chem 59:3392-408 (2016)  
Target
Name:
Insulin-like growth factor 1 receptor
Synonyms:
CD_antigen=CD221 IGF1R Insulin-like growth factor 1 receptor (IGF1R) Insulin-like growth factor 1 receptor alpha chain Insulin-like growth factor I receptor | Insulin-like growth factor receptor (IGFR)
Type:
Protein
Mol. Mass.:
154776.79
Organism:
Homo sapiens (Human)
Description:
P08069
Residue:
1367
  
Inhibitor
Name:
BDBM158155
Synonyms:
US10081622, Compound 4 US9255087, 4 | US9616059, 4
Type:
Small organic molecule
Emp. Form.:
C26H25F2N5O
Mol. Mass.:
461.5064
SMILES:
CN1CCN(CC1)c1ccc(cc1)C(=O)Nc1n[nH]c2ccc(Cc3cc(F)cc(F)c3)cc12
: