Target
Insulin receptor
Ligand
BDBM50170076
Substrate
Meas. Tech.
ChEMBL_1577156 (CHEMBL3807418)
IC50
1163±n/a nM
Citation
 Menichincheri, MArdini, EMagnaghi, PAvanzi, NBanfi, PBossi, RBuffa, LCanevari, GCeriani, LColombo, MCorti, LDonati, DFasolini, MFelder, EFiorelli, CFiorentini, FGalvani, AIsacchi, ABorgia, ALMarchionni, CNesi, MOrrenius, CPanzeri, APesenti, ERusconi, LSaccardo, MBVanotti, EPerrone, EOrsini, P Discovery of Entrectinib: A New 3-Aminoindazole As a Potent Anaplastic Lymphoma Kinase (ALK), c-ros Oncogene 1 Kinase (ROS1), and Pan-Tropomyosin Receptor Kinases (Pan-TRKs) inhibitor. J Med Chem 59:3392-408 (2016)  
Target
Name:
Insulin receptor
Synonyms:
INSR INSR_HUMAN Insulin receptor beta subunit
Type:
Receptor Tyrosine Kinase
Mol. Mass.:
156322.60
Organism:
Homo sapiens (Human)
Description:
P06213
Residue:
1382
  
Inhibitor
Name:
BDBM50170076
Synonyms:
CHEMBL3804988
Type:
Small organic molecule
Emp. Form.:
C32H36F2N6O2
Mol. Mass.:
574.664
SMILES:
C[C@@H](c1ccc2[nH]nc(NC(=O)c3ccc(cc3NC3CCOCC3)N3CCN(C)CC3)c2c1)c1cc(F)cc(F)c1
: