Target
Histamine H4 receptor
Ligand
BDBM50170122
Substrate
Meas. Tech.
ChEMBL_1577389 (CHEMBL3806523)
EC50
15±n/a nM
Citation
 Geyer, RNordemann, UStrasser, AWittmann, HJBuschauer, A Conformational Restriction and Enantioseparation Increase Potency and Selectivity of Cyanoguanidine-Type Histamine H4 Receptor Agonists. J Med Chem 59:3452-70 (2016)  
Target
Name:
Histamine H4 receptor
Synonyms:
AXOR35 GPCR105 HH4R HRH4 Histamine H4 receptor Histamine receptor (H3 and H4) SP9144
Type:
G Protein-Coupled Receptor (GPCR)
Mol. Mass.:
44517.02
Organism:
Homo sapiens (Human)
Description:
Binding assays were using CHO cells stably expressing hH4R receptors.
Residue:
390
  
Inhibitor
Name:
BDBM50170122
Synonyms:
CHEMBL3806255
Type:
Small organic molecule
Emp. Form.:
C15H24N6
Mol. Mass.:
288.3913
SMILES:
CC(C)CN\C(NC[C@H]1CC[C@@H](C1)c1c[nH]cn1)=N\C#N
: