Target
Histamine H3 receptor
Ligand
BDBM22880
Substrate
Meas. Tech.
ChEMBL_1577386 (CHEMBL3806427)
EC50
12400±n/a nM
Citation
 Geyer, RNordemann, UStrasser, AWittmann, HJBuschauer, A Conformational Restriction and Enantioseparation Increase Potency and Selectivity of Cyanoguanidine-Type Histamine H4 Receptor Agonists. J Med Chem 59:3452-70 (2016)  
Target
Name:
Histamine H3 receptor
Synonyms:
G-protein coupled receptor 97 HH3R HRH3 Histamine H3 receptor (H3) Histamine receptor (H3 and H4)
Type:
G Protein-Coupled Receptor (GPCR)
Mol. Mass.:
48691.47
Organism:
Homo sapiens (Human)
Description:
Binding assays were using CHO cells stably expressing hH3R receptors.
Residue:
445
  
Inhibitor
Name:
BDBM22880
Synonyms:
2-(5-methyl-1H-imidazol-4-yl)ethan-1-amine Methylhistamine-4
Type:
Small organic molecule
Emp. Form.:
C6H11N3
Mol. Mass.:
125.1716
SMILES:
Cc1nc[nH]c1CCN
: