Target
RAC-alpha serine/threonine-protein kinase
Ligand
BDBM50170282
Substrate
Meas. Tech.
ChEMBL_1577690 (CHEMBL3807471)
IC50
320±n/a nM
Citation
 Zhan, WXu, LDong, XDong, JYi, XMa, XQiu, NLi, JYang, BZhou, YHu, Y Design, synthesis and biological evaluation of pyrazol-furan carboxamide analogues as novel Akt kinase inhibitors. Eur J Med Chem 117:47-58 (2016)  
Target
Name:
RAC-alpha serine/threonine-protein kinase
Synonyms:
AKT phosphorylation (p-AKT) AKT1/PPP1CA C-AKT PKB alpha Protein kinase B Protein kinase B (Akt 1) Protein kinase B alpha Proto-oncogene Akt (Akt1) Proto-oncogene c-Akt (AKT1) RAC-PK-alpha RAC-alpha serine/threonine-protein kinase (AKT1) | RAC-alpha serine/threonine-protein kinase (pAKT)
Type:
Enzyme
Mol. Mass.:
55681.25
Organism:
Homo sapiens (Human)
Description:
P31749
Residue:
480
  
Inhibitor
Name:
BDBM50170282
Synonyms:
CHEMBL3806131
Type:
Small organic molecule
Emp. Form.:
C20H20ClFN4OS
Mol. Mass.:
418.915
SMILES:
Cn1ncc(Cl)c1-c1csc(c1)C(=O)NC1(CCNCC1)c1ccc(F)cc1
: