Target
Aminopeptidase N
Ligand
BDBM50170879
Substrate
Meas. Tech.
ChEMBL_1577953 (CHEMBL3806577)
Ki
4450±n/a nM
Citation
 Weglarz-Tomczak, EBerlicki, LPawelczak, MNocek, BJoachimiak, AMucha, A A structural insight into the P1S1 binding mode of diaminoethylphosphonic and phosphinic acids, selective inhibitors of alanine aminopeptidases. Eur J Med Chem 117:187-96 (2016)  
Target
Name:
Aminopeptidase N
Synonyms:
AMPN_HUMAN APN Aminopeptidase CD_antigen=CD13 Myeloid plasma membrane glycoprotein CD13 gp150 | hAPN
Type:
PROTEIN
Mol. Mass.:
109522.63
Organism:
Homo sapiens (Human)
Description:
ChEMBL_1507526
Residue:
967
  
Inhibitor
Name:
BDBM50170879
Synonyms:
CHEMBL3805472
Type:
Small organic molecule
Emp. Form.:
C12H19N2O4P
Mol. Mass.:
286.264
SMILES:
NCC(N)P(O)(=O)CC(Cc1ccccc1)C(O)=O
: