Target
Cytosol aminopeptidase [33-68,L62W]
Ligand
BDBM50170895
Substrate
Meas. Tech.
ChEMBL_1577950 (CHEMBL3806574)
Ki
69100±n/a nM
Citation
 Weglarz-Tomczak, EBerlicki, LPawelczak, MNocek, BJoachimiak, AMucha, A A structural insight into the P1S1 binding mode of diaminoethylphosphonic and phosphinic acids, selective inhibitors of alanine aminopeptidases. Eur J Med Chem 117:187-96 (2016)  
Target
Name:
Cytosol aminopeptidase [33-68,L62W]
Synonyms:
AMPL_PIG LAP3 | Leucine aminopeptidase (LAP)
Type:
Enzyme
Mol. Mass.:
4015.44
Organism:
Sus scrofa (Pig)
Description:
P28839[33-68,L62W]
Residue:
36
  
Inhibitor
Name:
BDBM50170895
Synonyms:
CHEMBL3805487
Type:
Small organic molecule
Emp. Form.:
C7H17N2O4P
Mol. Mass.:
224.1946
SMILES:
NC(CNCC1CCCO1)P(O)(O)=O
: