Target
Acyl-protein thioesterase 1
Ligand
BDBM50170959
Substrate
Meas. Tech.
ChEMBL_1578295 (CHEMBL3807663)
IC50
30000±n/a nM
Citation
 Cox, JMChu, HDKuethe, JTGao, YDScapin, GEiermann, GHe, HLi, XLyons, KAMetzger, JPetrov, AWu, JKXu, SSinha-Roy, RWeber, AEBiftu, T The discovery of novel 5,6,5- and 5,5,6-tricyclic pyrrolidines as potent and selective DPP-4 inhibitors. Bioorg Med Chem Lett 26:2622-6 (2016)  
Target
Name:
Acyl-protein thioesterase 1
Synonyms:
Acyl-protein thioesterase 1/2 LYPA1_RAT Lysosomal phospholipase A1
Type:
PROTEIN
Mol. Mass.:
24708.49
Organism:
Rattus norvegicus
Description:
ChEMBL_12731
Residue:
230
  
Inhibitor
Name:
BDBM50170959
Synonyms:
CHEMBL3805226
Type:
Small organic molecule
Emp. Form.:
C21H23F2N5
Mol. Mass.:
383.4376
SMILES:
Cc1cc2nc3CN(Cc3cn2n1)[C@H]1CC[C@@H]([C@@H](N)C1)c1cc(F)ccc1F
: