Target
Acyl-protein thioesterase 1
Ligand
BDBM50170938
Substrate
Meas. Tech.
ChEMBL_1578295 (CHEMBL3807663)
IC50
11000±n/a nM
Citation
 Cox, JMChu, HDKuethe, JTGao, YDScapin, GEiermann, GHe, HLi, XLyons, KAMetzger, JPetrov, AWu, JKXu, SSinha-Roy, RWeber, AEBiftu, T The discovery of novel 5,6,5- and 5,5,6-tricyclic pyrrolidines as potent and selective DPP-4 inhibitors. Bioorg Med Chem Lett 26:2622-6 (2016)  
Target
Name:
Acyl-protein thioesterase 1
Synonyms:
Acyl-protein thioesterase 1/2 LYPA1_RAT Lysosomal phospholipase A1
Type:
PROTEIN
Mol. Mass.:
24708.49
Organism:
Rattus norvegicus
Description:
ChEMBL_12731
Residue:
230
  
Inhibitor
Name:
BDBM50170938
Synonyms:
CHEMBL3806164
Type:
Small organic molecule
Emp. Form.:
C20H21F2N5
Mol. Mass.:
369.411
SMILES:
N[C@H]1C[C@@H](CC[C@@H]1c1cc(F)ccc1F)N1Cc2nn3cccnc3c2C1
: