Target
Proteasome subunit beta type-5
Ligand
BDBM50171000
Substrate
Meas. Tech.
ChEMBL_1576856 (CHEMBL3806500)
IC50
6100±n/a nM
Citation
 McDaniel, TJLansdell, TADissanayake, AAAzevedo, LMClaes, JOdom, ALTepe, JJ Substituted quinolines as noncovalent proteasome inhibitors. Bioorg Med Chem 24:2441-50 (2016)  
Target
Name:
Proteasome subunit beta type-5
Synonyms:
20S proteasome chymotrypsin-like LMPX PSB5_HUMAN Proteasome Macropain subunit MB1 X
Type:
Protein
Mol. Mass.:
28480.96
Organism:
Homo sapiens (Human)
Description:
Residue:
263
  
Inhibitor
Name:
BDBM50171000
Synonyms:
CHEMBL3805486
Type:
Small organic molecule
Emp. Form.:
C18H22N2
Mol. Mass.:
266.3807
SMILES:
CN(C)c1ccc2nc(C)c(cc2c1)C1=CCCCC1
: