Target
RAF proto-oncogene serine/threonine-protein kinase
Ligand
BDBM50172058
Substrate
Meas. Tech.
ChEMBL_1577193 (CHEMBL3807567)
IC50
22800±n/a nM
Citation
 Yang, YSYang, BZou, YLi, GZhu, HL Design, biological evaluation and 3D QSAR studies of novel dioxin-containing triaryl pyrazoline derivatives as potential B-Raf inhibitors. Bioorg Med Chem 24:3052-3061 (2016)  
Target
Name:
RAF proto-oncogene serine/threonine-protein kinase
Synonyms:
Craf RAF proto-oncogene serine/threonine-protein kinase Raf-1 | Raf1
Type:
PROTEIN
Mol. Mass.:
72947.25
Organism:
Mus musculus
Description:
ChEMBL_116790
Residue:
648
  
Inhibitor
Name:
BDBM50172058
Synonyms:
CHEMBL3805675
Type:
Small organic molecule
Emp. Form.:
C24H22N2O3
Mol. Mass.:
386.4431
SMILES:
COc1cccc(c1)C1CC(=NN1c1ccccc1)c1ccc2OCCOc2c1
: