Target
Beta-secretase 1
Ligand
BDBM50172104
Substrate
Meas. Tech.
ChEMBL_1578519 (CHEMBL3811214)
Kd
8.0±n/a nM
Citation
 Jordan, JBWhittington, DABartberger, MDSickmier, EAChen, KCheng, YJudd, T Fragment-Linking Approach Using (19)F NMR Spectroscopy To Obtain Highly Potent and Selective Inhibitors of฿-Secretase. J Med Chem 59:3732-49 (2016)  
Target
Name:
Beta-secretase 1
Synonyms:
ASP2 Aspartyl protease 2 BACE1 Beta-secretase (BACE) Beta-secretase 1 (BACE 1) Beta-secretase 1 (BACE1) Beta-site amyloid precursor protein cleaving enzyme 1 Memapsin-2 beta-Secretase (BACE-1) | beta-Secretase (BACE1)
Type:
Protein
Mol. Mass.:
55755.10
Organism:
Homo sapiens (Human)
Description:
P56817
Residue:
501
  
Inhibitor
Name:
BDBM50172104
Synonyms:
CHEMBL3808441
Type:
Small organic molecule
Emp. Form.:
C37H39FN4O2
Mol. Mass.:
590.7296
SMILES:
CC(C)(C)CCNC(=O)CCc1cc2cc(ccc2nc1N)-c1ccccc1C#CCC1(CC1)NC(=O)c1ccc(F)cc1
: