Target
Apelin receptor
Ligand
BDBM50172371
Substrate
Meas. Tech.
ChEMBL_1579549 (CHEMBL3810895)
EC50
1.9±n/a nM
Citation
 Murza, ASainsily, XCoquerel, DCôté, JMarx, PBesserer-Offroy, ÉLongpré, JMLainé, JReversade, BSalvail, DLeduc, RDumaine, RLesur, OAuger-Messier, MSarret, PMarsault, É Discovery and Structure-Activity Relationship of a Bioactive Fragment of ELABELA that Modulates Vascular and Cardiac Functions. J Med Chem 59:2962-72 (2016)  
Target
Name:
Apelin receptor
Synonyms:
AGTRL1 APJ_HUMAN Angiotensin receptor-like 1 Apelin receptor (APJ) G-protein coupled receptor HG11
Type:
Enzyme Catalytic Domain
Mol. Mass.:
42664.06
Organism:
Homo sapiens (Human)
Description:
P35414
Residue:
380
  
Inhibitor
Name:
BDBM50172371
Synonyms:
CHEMBL3809818
Type:
Small organic molecule
Emp. Form.:
C69H108N22O16S
Mol. Mass.:
1533.799
SMILES:
CSCC[C@H](NC(=O)[C@@H]1CCCN1C(=O)CNC(=O)[C@H](CCCCN)NC(=O)[C@H](Cc1cnc[nH]1)NC(=O)[C@H](CO)NC(=O)[C@H](CC(C)C)NC(=O)[C@H](CCCNC(N)=N)NC(=O)[C@@H]1CCCN1C(=O)[C@H](CCCNC(N)=N)NC(=O)C1CCC(=O)N1)C(=O)N1CCC[C@H]1C(=O)N[C@@H](Cc1ccccc1)C(O)=O
: