Target
Prostaglandin G/H synthase 1
Ligand
BDBM50172800
Substrate
Meas. Tech.
ChEMBL_1578589 (CHEMBL3811630)
IC50
3000±n/a nM
Citation
 Singh, PKaur, SKaur, JSingh, GBhatti, R Rational Design of Small Peptides for Optimal Inhibition of Cyclooxygenase-2: Development of a Highly Effective Anti-Inflammatory Agent. J Med Chem 59:3920-34 (2016)  
Target
Name:
Prostaglandin G/H synthase 1
Synonyms:
COX1 Cyclooxygenase-1 (COX-1) PTGS1 | Prostaglandin G/H synthase (cyclooxygenase)
Type:
Protein
Mol. Mass.:
68868.60
Organism:
Ovis aries (Sheep)
Description:
Residue:
600
  
Inhibitor
Name:
BDBM50172800
Synonyms:
CHEMBL3810167
Type:
Small organic molecule
Emp. Form.:
C27H34N4O7
Mol. Mass.:
526.5815
SMILES:
CC(C)C[C@H](NC(=O)[C@H](Cc1ccccc1)NC(=O)CNC(=O)CNC(=O)OCc1ccccc1)C(O)=O
: