Target
Alpha-1D adrenergic receptor
Ligand
BDBM50173111
Substrate
Meas. Tech.
ChEMBL_1579182 (CHEMBL3812085)
IC50
61±n/a nM
Citation
 Zhao, FLi, JChen, YTian, YWu, CXie, YZhou, YWang, JXie, XLiu, H Design, Synthesis, and Biological Evaluation of Indoline and Indole Derivatives as Potent and Selectivea1A-Adrenoceptor Antagonists. J Med Chem 59:3826-39 (2016)  
Target
Name:
Alpha-1D adrenergic receptor
Synonyms:
ADA1D_HUMAN ADRA1D Adrenergic receptor alpha Alpha 1D-adrenoreceptor Alpha-1D adrenoceptor adrenergic Alpha1D
Type:
Enzyme Catalytic Domain
Mol. Mass.:
60485.82
Organism:
Homo sapiens (Human)
Description:
adrenergic Alpha1D ADRA1D HUMAN::P25100
Residue:
572
  
Inhibitor
Name:
BDBM50173111
Synonyms:
CHEMBL3810220
Type:
Small organic molecule
Emp. Form.:
C25H35N3O4
Mol. Mass.:
441.5631
SMILES:
COc1cc(C)ccc1OCCNC(C)Cc1cc2CCN(CCCO)c2c(c1)C(N)=O
: