Target
Alpha-1B adrenergic receptor
Ligand
BDBM50173110
Substrate
Meas. Tech.
ChEMBL_1579181 (CHEMBL3812084)
IC50
981±n/a nM
Citation
 Zhao, FLi, JChen, YTian, YWu, CXie, YZhou, YWang, JXie, XLiu, H Design, Synthesis, and Biological Evaluation of Indoline and Indole Derivatives as Potent and Selectivea1A-Adrenoceptor Antagonists. J Med Chem 59:3826-39 (2016)  
Target
Name:
Alpha-1B adrenergic receptor
Synonyms:
ADA1B_HUMAN Adrenergic alpha1B Adrenergic receptor alpha Alpha 1B-adrenoreceptor | Alpha-1B adrenergic receptor
Type:
Enzyme
Mol. Mass.:
56862.13
Organism:
Homo sapiens (Human)
Description:
P35368
Residue:
520
  
Inhibitor
Name:
BDBM50173110
Synonyms:
CHEMBL3808511
Type:
Small organic molecule
Emp. Form.:
C23H27BrFN3O3
Mol. Mass.:
492.381
SMILES:
CC(Cc1cc(C(N)=O)c2n(CCCO)ccc2c1)NCCOc1ccc(F)cc1Br
: