Target
ALK tyrosine kinase receptor
Ligand
BDBM50434614
Substrate
Meas. Tech.
ChEMBL_1579204 (CHEMBL3812107)
IC50
4500±n/a nM
Citation
 Tu, CHLin, WHPeng, YHHsu, TWu, JSChang, CYLu, CTLyu, PCShih, CJiaang, WTWu, SY Pyrazolylamine Derivatives Reveal the Conformational Switching between Type I and Type II Binding Modes of Anaplastic Lymphoma Kinase (ALK). J Med Chem 59:3906-19 (2016)  
Target
Name:
ALK tyrosine kinase receptor
Synonyms:
ALK ALK_HUMAN CD_antigen: CD246
Type:
Protein
Mol. Mass.:
176453.10
Organism:
Homo sapiens (Human)
Description:
Q9UM73
Residue:
1620
  
Inhibitor
Name:
BDBM50434614
Synonyms:
CHEMBL2386803
Type:
Small organic molecule
Emp. Form.:
C31H38N8O3
Mol. Mass.:
570.6852
SMILES:
CN1CCN(Cc2ccc(cc2)C(=O)Nc2cc(n[nH]2)-c2ccc(CNC(=O)Nc3cc(on3)C(C)(C)C)cc2)CC1
: