Target
Sodium channel protein type 1 subunit alpha
Ligand
BDBM50173134
Substrate
Meas. Tech.
ChEMBL_1579959 (CHEMBL3813476)
IC50
400±n/a nM
Citation
 Koltun, DOParkhill, EQElzein, EKobayashi, TJiang, RHLi, XPerry, TDAvila, BWang, WQHirakawa, RSmith-Maxwell, CWu, LDhalla, AKRajamani, SMollova, NStafford, BTang, JBelardinelli, LZablocki, JA Discovery of triazolopyridinone GS-462808, a late sodium current inhibitor (Late INai) of the cardiac Nav1.5 channel with improved efficacy and potency relative to ranolazine. Bioorg Med Chem Lett 26:3207-11 (2016)  
Target
Name:
Sodium channel protein type 1 subunit alpha
Synonyms:
NAC1 SCN1A Sodium (Site 1) Sodium channel protein type 1 subunit alpha Sodium channel protein type I subunit alpha Voltage-gated sodium channel subunit alpha Nav1.1
Type:
Protein
Mol. Mass.:
228952.47
Organism:
Homo sapiens (Human)
Description:
P35498
Residue:
2009
  
Inhibitor
Name:
BDBM50173134
Synonyms:
CHEMBL3809595
Type:
Small organic molecule
Emp. Form.:
C14H7F6N3O
Mol. Mass.:
347.2153
SMILES:
FC(F)(F)Oc1ccc(cc1)-c1ccc2nnc(n2c1)C(F)(F)F
: