Target
Sodium channel protein type 5 subunit alpha
Ligand
BDBM50173141
Substrate
Meas. Tech.
ChEMBL_1579945 (CHEMBL3813329)
IC50
215000±n/a nM
Citation
 Koltun, DOParkhill, EQElzein, EKobayashi, TJiang, RHLi, XPerry, TDAvila, BWang, WQHirakawa, RSmith-Maxwell, CWu, LDhalla, AKRajamani, SMollova, NStafford, BTang, JBelardinelli, LZablocki, JA Discovery of triazolopyridinone GS-462808, a late sodium current inhibitor (Late INai) of the cardiac Nav1.5 channel with improved efficacy and potency relative to ranolazine. Bioorg Med Chem Lett 26:3207-11 (2016)  
Target
Name:
Sodium channel protein type 5 subunit alpha
Synonyms:
HH1 SCN5A_HUMAN Sodium channel protein type 5 subunit alpha/beta-1/beta-2 Voltage-gated sodium channel subunit alpha Nav1.5
Type:
Enzyme
Mol. Mass.:
226908.60
Organism:
Homo sapiens (Human)
Description:
Q14524
Residue:
2016
  
Inhibitor
Name:
BDBM50173141
Synonyms:
CHEMBL2147143
Type:
Small organic molecule
Emp. Form.:
C22H16FN5O3
Mol. Mass.:
417.3925
SMILES:
Cc1noc(Cn2nc3ccc(cn3c2=O)-c2ccc(Oc3ccc(F)cc3)cc2)n1
: