Target
Delta-type opioid receptor
Ligand
BDBM50174108
Substrate
Meas. Tech.
ChEMBL_1581396 (CHEMBL3812003)
Ki
>10000±n/a nM
Citation
 Shen, QQian, YHuang, XXu, XLi, WLiu, JFu, W Discovery of Potent and Selective Agonists ofd Opioid Receptor by Revisiting the"Message-Address" Concept. ACS Med Chem Lett 7:391-6 (2016)  
Target
Name:
Delta-type opioid receptor
Synonyms:
D-OR-1 Delta opioid receptor OPIATE Delta OPRD1 OPRK1 | opioid receptor, delta 1
Type:
G Protein-Coupled Receptor (GPCR)
Mol. Mass.:
40382.98
Organism:
Homo sapiens (Human)
Description:
Competition binding assays were carried out using membrane preparations from transfected HN9.10 cells that constitutively expressed the delta opioid receptor.
Residue:
372
  
Inhibitor
Name:
BDBM50174108
Synonyms:
CHEMBL3809808
Type:
Small organic molecule
Emp. Form.:
C26H29NO2
Mol. Mass.:
387.514
SMILES:
COc1cccc(c1)[C@]1(O)[C@@H](CN(C)C)CCc2cc(ccc12)-c1ccccc1
: