Target
Mu-type opioid receptor
Ligand
BDBM50174032
Substrate
Meas. Tech.
ChEMBL_1581394 (CHEMBL3812001)
Ki
>10000±n/a nM
Citation
 Shen, QQian, YHuang, XXu, XLi, WLiu, JFu, W Discovery of Potent and Selective Agonists ofd Opioid Receptor by Revisiting the"Message-Address" Concept. ACS Med Chem Lett 7:391-6 (2016)  
Target
Name:
Mu-type opioid receptor
Synonyms:
M-OR-1 MOR-1 MUOR1 Mu opiate receptor OPRM1 hMOP | mu-type opioid receptor isoform MOR-1
Type:
G Protein-Coupled Receptor (GPCR)
Mol. Mass.:
44789.51
Organism:
Homo sapiens (Human)
Description:
P35372
Residue:
400
  
Inhibitor
Name:
BDBM50174032
Synonyms:
CHEMBL3808835
Type:
Small organic molecule
Emp. Form.:
C26H29NO3
Mol. Mass.:
403.5134
SMILES:
COc1ccccc1-c1ccc2c(CC[C@H](CN(C)C)[C@@]2(O)c2cccc(O)c2)c1
: