Target
Muscarinic acetylcholine receptor M4
Ligand
BDBM50174737
Substrate
Meas. Tech.
ChEMBL_1579487 (CHEMBL3810685)
EC50
160±n/a nM
Citation
 Wood, MRNoetzel, MJEngers, JLBollinger, KAMelancon, BJTarr, JCHan, CWest, MGregro, ARLamsal, AChang, SAjmera, SSmith, EChase, PHodder, PSBubser, MJones, CKHopkins, CREmmitte, KANiswender, CMWood, MWDuggan, MEConn, PJBridges, TMLindsley, CW Discovery and optimization of a novel series of highly CNS penetrant M4 PAMs based on a 5,6-dimethyl-4-(piperidin-1-yl)thieno[2,3-d]pyrimidine core. Bioorg Med Chem Lett 26:3029-33 (2016)  
Target
Name:
Muscarinic acetylcholine receptor M4
Synonyms:
ACM4_RAT Chrm-4 | Chrm4
Type:
Enzyme Catalytic Domain
Mol. Mass.:
52841.70
Organism:
RAT
Description:
Cholinergic, muscarinic M4 CHRM4 RAT::P08485
Residue:
477
  
Inhibitor
Name:
BDBM50174737
Synonyms:
CHEMBL1357034
Type:
Small organic molecule
Emp. Form.:
C20H23N5O3S2
Mol. Mass.:
445.558
SMILES:
Cc1sc2ncnc(N3CCC(CC3)C(=O)Nc3ccc(cc3)S(N)(=O)=O)c2c1C
: