Target
Aurora kinase B
Ligand
BDBM50175306
Substrate
Meas. Tech.
ChEMBL_1581135 (CHEMBL3813580)
IC50
10200±n/a nM
Citation
 An, YLee, EYu, YYun, JLee, MYKang, JSKim, WYJeon, R Design and synthesis of novel benzoxazole analogs as Aurora B kinase inhibitors. Bioorg Med Chem Lett 26:3067-72 (2016)  
Target
Name:
Aurora kinase B
Synonyms:
AIK2 AIM1 ARK2 AURKB_HUMAN Aurora B-INCENP Aurora kinase B (AURKB) STK-1 STK12 Serine/threonine-protein kinase aurora B
Type:
Protein
Mol. Mass.:
39327.72
Organism:
Homo sapiens (Human)
Description:
Q96GD4
Residue:
344
  
Inhibitor
Name:
BDBM50175306
Synonyms:
CHEMBL3809709
Type:
Small organic molecule
Emp. Form.:
C27H28ClN5O4
Mol. Mass.:
521.995
SMILES:
Clc1ccc(NC(=O)Nc2ccc(CNc3nc4ccc(OCCN5CCOCC5)cc4o3)cc2)cc1
: