Target
Aurora kinase B
Ligand
BDBM50175513
Substrate
Meas. Tech.
ChEMBL_1581135 (CHEMBL3813580)
IC50
49400±n/a nM
Citation
 An, YLee, EYu, YYun, JLee, MYKang, JSKim, WYJeon, R Design and synthesis of novel benzoxazole analogs as Aurora B kinase inhibitors. Bioorg Med Chem Lett 26:3067-72 (2016)  
Target
Name:
Aurora kinase B
Synonyms:
AIK2 AIM1 ARK2 AURKB_HUMAN Aurora B-INCENP Aurora kinase B (AURKB) STK-1 STK12 Serine/threonine-protein kinase aurora B
Type:
Protein
Mol. Mass.:
39327.72
Organism:
Homo sapiens (Human)
Description:
Q96GD4
Residue:
344
  
Inhibitor
Name:
BDBM50175513
Synonyms:
CHEMBL3808933
Type:
Small organic molecule
Emp. Form.:
C27H27Cl2N5O4
Mol. Mass.:
556.44
SMILES:
Clc1ccc(NC(=O)Nc2ccc(COc3ccc4nc(NCCN5CCOCC5)oc4c3)cc2)cc1Cl
: