Target
Oxysterols receptor LXR-beta
Ligand
BDBM50177010
Substrate
Meas. Tech.
ChEMBL_1582619 (CHEMBL3817027)
EC50
1.000000±n/a nM
Citation
 Zheng, YZhuang, LFan, KYTice, CMZhao, WDong, CLotesta, SDLeftheris, KLindblom, PRLiu, ZShimada, JNoto, PBMeng, SHardy, AHoward, LKrosky, PGuo, JLipinski, KKandpal, GBukhtiyarov, YZhao, YLala, DVan Orden, RZhou, JChen, GWu, ZMcKeever, BMMcGeehan, GMGregg, REClaremon, DASingh, SB Discovery of a Novel, Orally Efficacious Liver X Receptor (LXR)ß Agonist. J Med Chem 59:3264-71 (2016)  
Target
Name:
Oxysterols receptor LXR-beta
Synonyms:
LXRB Liver X, LXR beta NR1H2 Nuclear receptor NER Ubiquitously-expressed nuclear receptor
Type:
Enzyme Catalytic Domain
Mol. Mass.:
50978.79
Organism:
Homo sapiens (Human)
Description:
P55055
Residue:
460
  
Inhibitor
Name:
BDBM50177010
Synonyms:
CHEMBL3814006
Type:
Small organic molecule
Emp. Form.:
C27H24F3NO5S3
Mol. Mass.:
595.673
SMILES:
CS(=O)(=O)c1cc(ccc1CO)-c1ccc(CN(Cc2ccccc2)S(=O)(=O)c2ccccc2C(F)(F)F)s1
: