Target
Receptor-type tyrosine-protein kinase FLT3
Ligand
BDBM50177716
Substrate
Meas. Tech.
ChEMBL_1583399 (CHEMBL3815409)
IC50
130±n/a nM
Citation
 Hatcher, JMWeisberg, ESim, TStone, RMLiu, SGriffin, JDGray, NS Discovery of a Highly Potent and Selective Indenoindolone Type 1 Pan-FLT3 Inhibitor. ACS Med Chem Lett 7:476-81 (2016)  
Target
Name:
Receptor-type tyrosine-protein kinase FLT3
Synonyms:
CD135 FL cytokine receptor FLK2 FLT3 Fetal liver kinase-2 Fms-like tyrosine kinase 3 (Flt-3) STK-1 Stem cell tyrosine kinase 1
Type:
Enzyme
Mol. Mass.:
112888.62
Organism:
Homo sapiens (Human)
Description:
P36888
Residue:
993
  
Inhibitor
Name:
BDBM50177716
Synonyms:
CHEMBL3813873 US20230382871, Compound PLX3397
Type:
Small organic molecule
Emp. Form.:
C20H15ClF3N5
Mol. Mass.:
417.815
SMILES:
FC(F)(F)c1ccc(CNc2ccc(Cc3c[nH]c4ncc(Cl)cc34)cn2)cn1
: