Target
Ectonucleotide pyrophosphatase/phosphodiesterase family member 1
Ligand
BDBM50179379
Substrate
Meas. Tech.
ChEMBL_1583537 (CHEMBL3815624)
Ki
8560±n/a nM
Citation
 Lee, SYPerotti, ADe Jonghe, SHerdewijn, PHanck, TMüller, CE Thiazolo[3,2-a]benzimidazol-3(2H)-one derivatives: Structure-activity relationships of selective nucleotide pyrophosphatase/phosphodiesterase1 (NPP1) inhibitors. Bioorg Med Chem 24:3157-65 (2016)  
Target
Name:
Ectonucleotide pyrophosphatase/phosphodiesterase family member 1
Synonyms:
ENPP1 M6S1 PC1 | PDNP1
Type:
PROTEIN
Mol. Mass.:
104934.43
Organism:
Homo sapiens (Human)
Description:
ChEMBL_1448940
Residue:
925
  
Inhibitor
Name:
BDBM50179379
Synonyms:
CHEMBL3814894
Type:
Small organic molecule
Emp. Form.:
C28H31N5O3S
Mol. Mass.:
517.642
SMILES:
CC1CCN(CC1)c1cc(N2CCC(C)CC2)c(cc1\C=c1\sc2nc3ccccc3n2c1=O)[N+]([O-])=O
: