Target
Nischarin
Ligand
BDBM50070328
Substrate
Meas. Tech.
ChEMBL_1583797 (CHEMBL3815884)
Ki
13±n/a nM
Citation
 Vucicevic, JSrdic-Rajic, TPieroni, MLaurila, JMPerovic, VTassini, SAzzali, ECostantino, GGlisic, SAgbaba, DScheinin, MNikolic, KRadi, MVeljkovic, N A combined ligand- and structure-based approach for the identification of rilmenidine-derived compounds which synergize the antitumor effects of doxorubicin. Bioorg Med Chem 24:3174-83 (2016)  
Target
Name:
Nischarin
Synonyms:
Imidazoline I1 Nisch | Nischarin
Type:
Enzyme Catalytic Domain
Mol. Mass.:
166460.59
Organism:
RAT
Description:
Q4G017
Residue:
1502
  
Inhibitor
Name:
BDBM50070328
Synonyms:
CHEBI:8862 | Rilmenidine
Type:
Small organic molecule
Emp. Form.:
C10H16N2O
Mol. Mass.:
180.2468
SMILES:
C1CC1C(NC1=NCCO1)C1CC1
: