Target
Oxytocin receptor
Ligand
BDBM50180160
Substrate
Meas. Tech.
ChEMBL_1583335 (CHEMBL3816398)
Ki
3.7±n/a nM
Citation
 Sciabola, SGoetz, GHBai, GRogers, BNGray, DLDuplantier, AFonseca, KRVanase-Frawley, MAKablaoui, NM Systematic N-methylation of oxytocin: Impact on pharmacology and intramolecular hydrogen bonding network. Bioorg Med Chem 24:3513-20 (2016)  
Target
Name:
Oxytocin receptor
Synonyms:
OT-R OXYR_HUMAN | Oxytocin
Type:
Enzyme Catalytic Domain
Mol. Mass.:
42793.26
Organism:
Homo sapiens (Human)
Description:
Oxytocin OXTR HEK293::B2R9L7
Residue:
389
  
Inhibitor
Name:
BDBM50180160
Synonyms:
CHEMBL3815099
Type:
Small organic molecule
Emp. Form.:
C45H69N11O12S2
Mol. Mass.:
1020.226
SMILES:
[H][C@]1(NC(=O)[C@H](Cc2ccc(O)cc2)NC(=O)CCSSC[C@H](NC(=O)[C@H](CC(N)=O)NC(=O)[C@H](CCC(N)=O)NC1=O)C(=O)N1CCC[C@H]1C(=O)N(C)[C@@H](CC(C)C)C(=O)N(C)CC(N)=O)[C@@H](C)CC
: