Target
Polyunsaturated fatty acid lipoxygenase ALOX15
Ligand
BDBM50180652
Substrate
Meas. Tech.
ChEMBL_1584215 (CHEMBL3821684)
Kd
3900±n/a nM
Citation
 Meng, HMcClendon, CLDai, ZLi, KZhang, XHe, SShang, ELiu, YLai, L Discovery of Novel 15-Lipoxygenase Activators To Shift the Human Arachidonic Acid Metabolic Network toward Inflammation Resolution. J Med Chem 59:4202-9 (2016)  
Target
Name:
Polyunsaturated fatty acid lipoxygenase ALOX15
Synonyms:
15-Lipoxygenase-1 (15-LOX-1) Arachidonate 15-lipoxygenase LOG15 Reticulocyte 15-lipoxygenase-1 | Sphingosine 1-phosphate receptor 1 (S1P1)
Type:
Protein
Mol. Mass.:
74804.05
Organism:
Homo sapiens (Human)
Description:
Residue:
662
  
Inhibitor
Name:
BDBM50180652
Synonyms:
CHEMBL3819527
Type:
Small organic molecule
Emp. Form.:
C27H32N4O
Mol. Mass.:
428.5692
SMILES:
CN1CCN(CC(=O)N2N=C3C(CCC\C3=C/c3ccccc3)C2c2ccccc2)CC1
: