Target
Potassium channel subfamily K member 10
Ligand
BDBM25759
Substrate
Meas. Tech.
ChEMBL_1584418 (CHEMBL3819961)
IC50
24000±n/a nM
Citation
 Vivier, DBennis, KLesage, FDucki, S Perspectives on the Two-Pore Domain Potassium Channel TREK-1 (TWIK-Related K(+) Channel 1). A Novel Therapeutic Target? J Med Chem 59:5149-57 (2016)  
Target
Name:
Potassium channel subfamily K member 10
Synonyms:
KCNK10 Outward rectifying potassium channel protein TREK-2 TREK-2 K(+) channel subunit | TREK2
Type:
PROTEIN
Mol. Mass.:
59774.98
Organism:
Homo sapiens (Human)
Description:
ChEMBL_105637
Residue:
538
  
Inhibitor
Name:
BDBM25759
Synonyms:
CHEMBL723 Coreg Eucardic | [3-(9H-carbazol-4-yloxy)-2-hydroxypropyl][2-(2-methoxyphenoxy)ethyl]amine
Type:
Small organic molecule
Emp. Form.:
C24H26N2O4
Mol. Mass.:
406.4742
SMILES:
COc1ccccc1OCCNCC(O)COc1cccc2[nH]c3ccccc3c12
: