Target
Aromatase
Ligand
BDBM10015
Substrate
Meas. Tech.
ChEMBL_1584552 (CHEMBL3820543)
IC50
3.6±n/a nM
Citation
 Ghosh, DLo, JEgbuta, C Recent Progress in the Discovery of Next Generation Inhibitors of Aromatase from the Structure-Function Perspective. J Med Chem 59:5131-48 (2016)  
Target
Name:
Aromatase
Synonyms:
ARO1 CP19A_HUMAN CYP19 CYPXIX Cytochrome P450 19A1 Cytochrome P450-C19 (CYP19) FL cytokine receptor precursor | P-450AROM
Type:
Enzyme
Mol. Mass.:
57888.92
Organism:
Homo sapiens (Human)
Description:
P11511
Residue:
503
  
Inhibitor
Name:
BDBM10015
Synonyms:
2-[3-(1-cyano-1-methylethyl)-5-(1H-1,2,4-triazol-1-ylmethyl)phenyl]-2-methylpropanenitrile ANASTROZOLE NSC719344 | arimidex
Type:
Small organic molecule
Emp. Form.:
C17H19N5
Mol. Mass.:
293.3663
SMILES:
CC(C)(C#N)c1cc(Cn2cncn2)cc(c1)C(C)(C)C#N
: