Target
Nuclear factor erythroid 2-related factor 2
Ligand
BDBM50180850
Substrate
Meas. Tech.
ChEMBL_1584829 (CHEMBL3822052)
EC50
27±n/a nM
Citation
 Davies, TGWixted, WECoyle, JEGriffiths-Jones, CHearn, KMcMenamin, RNorton, DRich, SJRichardson, CSaxty, GWillems, HMWoolford, AJCottom, JEKou, JPYonchuk, JGFeldser, HGSanchez, YFoley, JPBolognese, BJLogan, GPodolin, PLYan, HCallahan, JFHeightman, TDKerns, JK Monoacidic Inhibitors of the Kelch-like ECH-Associated Protein 1: Nuclear Factor Erythroid 2-Related Factor 2 (KEAP1:NRF2) Protein-Protein Interaction with High Cell Potency Identified by Fragment-Based Discovery. J Med Chem 59:3991-4006 (2016)  
Target
Name:
Nuclear factor erythroid 2-related factor 2
Synonyms:
HEBP1 NF-E2-related factor 2 NFE2-related factor 2 NRF2 Nuclear factor, erythroid derived 2, like 2
Type:
PROTEIN
Mol. Mass.:
67786.89
Organism:
Homo sapiens (Human)
Description:
ChEMBL_107924
Residue:
605
  
Inhibitor
Name:
BDBM50180850
Synonyms:
CHEMBL3819587
Type:
Small organic molecule
Emp. Form.:
C28H30N4O6S
Mol. Mass.:
550.626
SMILES:
COc1cc(cc2nnn(C)c12)[C@@H](CC(O)=O)c1ccc(C)c(CN2C[C@@H](C)Oc3ccccc3S2(=O)=O)c1
: