Target
Proteinase-activated receptor 1
Ligand
BDBM50181506
Substrate
Meas. Tech.
ChEMBL_1585283 (CHEMBL3821546)
IC50
10±n/a nM
Citation
 Eggert, EHillig, RCKoehr, SStöckigt, DWeiske, JBarak, NMowat, JBrumby, TChrist, CDTer Laak, ALang, TFernandez-Montalvan, AEBadock, VWeinmann, HHartung, IVBarsyte-Lovejoy, DSzewczyk, MKennedy, SLi, FVedadi, MBrown, PJSanthakumar, VArrowsmith, CHStellfeld, TStresemann, C Discovery and Characterization of a Highly Potent and Selective Aminopyrazoline-Based in Vivo Probe (BAY-598) for the Protein Lysine Methyltransferase SMYD2. J Med Chem 59:4578-600 (2016)  
Target
Name:
Proteinase-activated receptor 1
Synonyms:
CF2R F2R PAR1 Proteinase activated receptor 1 TR Thrombin receptor/ Proteinase-activated receptor 1(Par-1)
Type:
Protein
Mol. Mass.:
47450.07
Organism:
Homo sapiens (Human)
Description:
P25116
Residue:
425
  
Inhibitor
Name:
BDBM50181506
Synonyms:
CHEMBL3819038
Type:
Small organic molecule
Emp. Form.:
C23H24Cl2N6O2
Mol. Mass.:
487.382
SMILES:
CCN(C1CN(N=C1c1ccc(Cl)cc1)C(\NCCc1cccc(Cl)c1)=N/C#N)C(=O)CO
: