Target
N-lysine methyltransferase SMYD2
Ligand
BDBM50181511
Substrate
Meas. Tech.
ChEMBL_1585277 (CHEMBL3821408)
IC50
15800±n/a nM
Citation
 Eggert, EHillig, RCKoehr, SStöckigt, DWeiske, JBarak, NMowat, JBrumby, TChrist, CDTer Laak, ALang, TFernandez-Montalvan, AEBadock, VWeinmann, HHartung, IVBarsyte-Lovejoy, DSzewczyk, MKennedy, SLi, FVedadi, MBrown, PJSanthakumar, VArrowsmith, CHStellfeld, TStresemann, C Discovery and Characterization of a Highly Potent and Selective Aminopyrazoline-Based in Vivo Probe (BAY-598) for the Protein Lysine Methyltransferase SMYD2. J Med Chem 59:4578-600 (2016)  
Target
Name:
N-lysine methyltransferase SMYD2
Synonyms:
HSKM-B KMT3C N-lysine methyltransferase SMYD2 SET and MYND domain-containing protein 2 (SMYD2) SMYD2_HUMAN
Type:
Enzyme
Mol. Mass.:
49689.57
Organism:
Homo sapiens (Human)
Description:
Q9NRG4
Residue:
433
  
Inhibitor
Name:
BDBM50181511
Synonyms:
CHEMBL3819343
Type:
Small organic molecule
Emp. Form.:
C22H21ClF2N6O3
Mol. Mass.:
490.89
SMILES:
CCN(C1CN(N=C1c1ccc(Cl)cc1)C(\Nc1ccc(OC(F)F)cc1)=N/C#N)C(=O)CO
: