Target
Histone deacetylase 1
Ligand
BDBM50180981
Substrate
Meas. Tech.
ChEMBL_1584188 (CHEMBL3821506)
IC50
270±n/a nM
Citation
 Zhang, ZHou, SChen, HRan, TJiang, FBian, YZhang, DZhi, YWang, LZhang, LLi, HZhang, YTang, WLu, TChen, Y Targeting epigenetic reader and eraser: Rational design, synthesis and in vitro evaluation of dimethylisoxazoles derivatives as BRD4/HDAC dual inhibitors. Bioorg Med Chem Lett 26:2931-2935 (2016)  
Target
Name:
Histone deacetylase 1
Synonyms:
Cereblon/Histone deacetylase 1 HDAC1 Histone deacetylase 1 (HDAC1) RPD3L1
Type:
Enzyme
Mol. Mass.:
55090.27
Organism:
Homo sapiens (Human)
Description:
Q13547
Residue:
482
  
Inhibitor
Name:
BDBM50180981
Synonyms:
CHEMBL3818026
Type:
Small organic molecule
Emp. Form.:
C25H27N3O5
Mol. Mass.:
449.499
SMILES:
Cc1noc(C)c1-c1cc(NC(=O)CCCCCC(=O)NO)cc(c1)C(=O)c1ccccc1
: