Target
Serine/threonine-protein kinase PAK 1
Ligand
BDBM50181449
Substrate
Meas. Tech.
ChEBML_1584620
Ki
2.7±n/a nM
Citation
 Rudolph, JMurray, LJNdubaku, COO'Brien, TBlackwood, EWang, WAliagas, IGazzard, LCrawford, JJDrobnick, JLee, WZhao, XHoeflich, KPFavor, DADong, PZhang, HHeise, CEOh, AOng, CCLa, HChakravarty, PChan, CJakubiak, DEpler, JRamaswamy, SVega, RCain, GDiaz, DZhong, Y Chemically Diverse Group I p21-Activated Kinase (PAK) Inhibitors Impart Acute Cardiovascular Toxicity with a Narrow Therapeutic Window. J Med Chem 59:5520-41 (2016)  
Target
Name:
Serine/threonine-protein kinase PAK 1
Synonyms:
2.7.11.1 Cell division control protein 42 homolog PAK-1 PAK1_HUMAN p21-activated kinase 1 | p65-PAK
Type:
Mol. Mass.:
60640.15
Organism:
Homo sapiens (Human)
Description:
Q13153
Residue:
545
  
Inhibitor
Name:
BDBM50181449
Synonyms:
CHEMBL3817856
Type:
Small organic molecule
Emp. Form.:
C26H25ClF2N6O2
Mol. Mass.:
526.966
SMILES:
CNc1ncc2cc(-c3ccc(cc3Cl)-n3cccc(C)c3=O)c(=O)n(CC3CCNCC3(F)F)c2n1
: