Target
2-amino-4-hydroxy-6-hydroxymethyldihydropteridine pyrophosphokinase
Ligand
BDBM50181523
Substrate
Meas. Tech.
ChEMBL_1585632 (CHEMBL3820451)
Kd
2700±n/a nM
Citation
 Dennis, MLPitcher, NPLee, MDDeBono, AJWang, ZCHarjani, JRRahmani, RCleary, BPeat, TSBaell, JBSwarbrick, JD Structural Basis for the Selective Binding of Inhibitors to 6-Hydroxymethyl-7,8-dihydropterin Pyrophosphokinase from Staphylococcus aureus and Escherichia coli. J Med Chem 59:5248-63 (2016)  
Target
Name:
2-amino-4-hydroxy-6-hydroxymethyldihydropteridine pyrophosphokinase
Synonyms:
2-amino-4-hydroxy-6-hydroxymethyldihydropteridine pyrophosphokinase 7,8-dihydro-6-hydroxymethylpterin-pyrophosphokinase HPPK_ECOLI PPPK | folK
Type:
PROTEIN
Mol. Mass.:
18075.55
Organism:
Escherichia coli (strain K12)
Description:
ChEMBL_108237
Residue:
159
  
Inhibitor
Name:
BDBM50181523
Synonyms:
CHEMBL3819281
Type:
Small organic molecule
Emp. Form.:
C13H9FN6OS
Mol. Mass.:
316.314
SMILES:
Nc1nc2[nH]c(SCc3ccc(cc3F)C#N)nc2c(=O)[nH]1
: