Target
C-X-C chemokine receptor type 2
Ligand
BDBM50182273
Substrate
Meas. Tech.
ChEMBL_1585799 (CHEMBL3821596)
IC50
0.501187±n/a nM
Citation
 Xu, HLu, HXu, ZLuan, LLi, CXu, YDong, KZhang, JLi, XLi, YLiu, GGong, SZhao, YGLiu, AZhang, YZhang, WCai, XXiang, JNElliott, JDLin, X Discovery of CNS Penetrant CXCR2 Antagonists for the Potential Treatment of CNS Demyelinating Disorders. ACS Med Chem Lett 7:397-402 (2016)  
Target
Name:
C-X-C chemokine receptor type 2
Synonyms:
C-X-C chemokine receptor type 2 (CXCR-2) CD_antigen=CD182 CXCR-2 CXCR2_HUMAN GRO/MGSA receptor IL-8 receptor type 2 IL8RB | Interleukin-8 receptor B
Type:
Protein
Mol. Mass.:
40767.88
Organism:
Homo sapiens (Human)
Description:
P25025
Residue:
360
  
Inhibitor
Name:
BDBM50182273
Synonyms:
CHEMBL3818827
Type:
Small organic molecule
Emp. Form.:
C20H22Cl2FN3O4S
Mol. Mass.:
490.376
SMILES:
CN1CCC[C@@H](CC1)S(=O)(=O)c1c(Cl)ccc(NC(=O)Nc2cccc(F)c2Cl)c1O
: