Target
C-X-C chemokine receptor type 2
Ligand
BDBM50182265
Substrate
Meas. Tech.
ChEMBL_1585800 (CHEMBL3821597)
IC50
40±n/a nM
Citation
 Xu, HLu, HXu, ZLuan, LLi, CXu, YDong, KZhang, JLi, XLi, YLiu, GGong, SZhao, YGLiu, AZhang, YZhang, WCai, XXiang, JNElliott, JDLin, X Discovery of CNS Penetrant CXCR2 Antagonists for the Potential Treatment of CNS Demyelinating Disorders. ACS Med Chem Lett 7:397-402 (2016)  
Target
Name:
C-X-C chemokine receptor type 2
Synonyms:
C-X-C chemokine receptor type 2 (CXCR-2) CD_antigen=CD182 CXCR-2 CXCR2_HUMAN GRO/MGSA receptor IL-8 receptor type 2 IL8RB | Interleukin-8 receptor B
Type:
Protein
Mol. Mass.:
40767.88
Organism:
Homo sapiens (Human)
Description:
P25025
Residue:
360
  
Inhibitor
Name:
BDBM50182265
Synonyms:
CHEMBL3819569
Type:
Small organic molecule
Emp. Form.:
C17H17Cl2FN2O4S
Mol. Mass.:
435.297
SMILES:
CC(C)(C)S(=O)(=O)c1c(O)c(NC(=O)Nc2cccc(F)c2Cl)ccc1Cl
: