Target
Transcription activator BRG1
Ligand
BDBM50182280
Substrate
Meas. Tech.
ChEMBL_1585835 (CHEMBL3821767)
Kd
49±n/a nM
Citation
 Gerstenberger, BSTrzupek, JDTallant, CFedorov, OFilippakopoulos, PBrennan, PEFedele, VMartin, SPicaud, SRogers, CParikh, MTaylor, ASamas, BO'Mahony, ABerg, EPallares, GTorrey, ADTreiber, DKSamardjiev, IJNasipak, BTPadilla-Benavides, TWu, QImbalzano, ANNickerson, JABunnage, MEMüller, SKnapp, SOwen, DR Identification of a Chemical Probe for Family VIII Bromodomains through Optimization of a Fragment Hit. J Med Chem 59:4800-11 (2016)  
Target
Name:
Transcription activator BRG1
Synonyms:
ATP-dependent helicase SMARCA4 BRG1 Mitotic growth and transcription activator Protein brahma homolog 1 SMCA4_HUMAN SNF2B SWI/SNF-related matrix-associated actin-dependent regulator of chromatin subfamily A member 4
Type:
PROTEIN
Mol. Mass.:
184666.66
Organism:
Homo sapiens (Human)
Description:
ChEMBL_107968
Residue:
1647
  
Inhibitor
Name:
BDBM50182280
Synonyms:
CHEMBL3819245
Type:
Small organic molecule
Emp. Form.:
C19H20N4O2
Mol. Mass.:
336.3877
SMILES:
Oc1ccccc1C(=O)\C=C\N1CCc2c(C1)ncnc2NC1CC1
: