Target
Adenosine receptor A2a/A2b
Ligand
BDBM50182282
Substrate
Meas. Tech.
ChEMBL_1584153 (CHEMBL3821345)
IC50
50±n/a nM
Citation
 Massink, ALouvel, JAdlere, Ivan Veen, CHuisman, BJDijksteel, GSGuo, DLenselink, EBBuckley, BJMatthews, HRanson, MKelso, MIJzerman, AP 5'-Substituted Amiloride Derivatives as Allosteric Modulators Binding in the Sodium Ion Pocket of the Adenosine A2A Receptor. J Med Chem 59:4769-77 (2016)  
Target
Name:
Adenosine receptor A2a/A2b
Synonyms:
Adenosine A2 receptor
Type:
Mol. Mass.:
Description:
ASSAY_ID of ChEMBL is 329906
Components:
This complex has 2 components.
Component 1
Name:
Adenosine receptor A2b
Synonyms:
AA2BR_HUMAN ADORA2B Adenosine receptors A2b | Adenosine receptors; A2a & A2b
Type:
G Protein-Coupled Receptor (GPCR)
Mol. Mass.:
36341.22
Organism:
Homo sapiens (Human)
Description:
Residue:
332
  
Component 2
Name:
Adenosine receptor A2a
Synonyms:
A2A adenosine receptor (hA2A) ADENOSINE A2 ADORA2 Adenosine A2A receptor (A2AAR)
Type:
G Protein-Coupled Receptor (GPCR)
Mol. Mass.:
44716.46
Organism:
Homo sapiens (Human)
Description:
P29274
Residue:
412
  
Inhibitor
Name:
BDBM50182282
Synonyms:
CHEMBL3818905
Type:
Small organic molecule
Emp. Form.:
C18H21ClF3N7O4
Mol. Mass.:
491.852
SMILES:
[#8]-[#6](=O)C(F)(F)F.[#6]-[#6]-[#8]-c1ccc(-[#6]-[#6]-[#7]-c2nc(-[#7])c(nc2Cl)-[#6](=O)\[#7]=[#6](\[#7])-[#7])cc1
: