Target
Fibroblast growth factor 2
Ligand
BDBM50182285
Substrate
Meas. Tech.
ChEMBL_1584167 (CHEMBL3821485)
IC50
10000±n/a nM
Citation
 Castelli, RGiacomini, AAnselmi, MBozza, NVacondio, FRivara, SMatarazzo, SPresta, MMor, MRonca, R Synthesis, Structural Elucidation, and Biological Evaluation of NSC12, an Orally Available Fibroblast Growth Factor (FGF) Ligand Trap for the Treatment of FGF-Dependent Lung Tumors. J Med Chem 59:4651-63 (2016)  
Target
Name:
Fibroblast growth factor 2
Synonyms:
Basic fibroblast growth factor FGF2 FGFB Fibroblast growth factor receptor 2 (FGF-2) Heparin-binding growth factor 2
Type:
Protein
Mol. Mass.:
30803.89
Organism:
Homo sapiens (Human)
Description:
P09038
Residue:
288
  
Inhibitor
Name:
BDBM50182285
Synonyms:
CHEMBL3819473
Type:
Small organic molecule
Emp. Form.:
C24H34F6O3
Mol. Mass.:
484.5154
SMILES:
[H][C@@]1(CC[C@@]2([H])[C@]3([H])CC=C4C[C@@H](O)CC[C@]4(C)[C@@]3([H])CC[C@]12C)[C@@H](O)CC(O)(C(F)(F)F)C(F)(F)F
: