Target
Hepatocyte growth factor receptor
Ligand
BDBM50182519
Substrate
Meas. Tech.
ChEBML_1585992
IC50
9.3±n/a nM
Citation
 Zhao, JFang, LZhang, XLiang, YGou, S Synthesis and biological evaluation of new [1,2,4]triazolo[4,3-a]pyridine derivatives as potential c-Met inhibitors. Bioorg Med Chem 24:3483-93 (2016)  
Target
Name:
Hepatocyte growth factor receptor
Synonyms:
Hepatocyte growth factor receptor Hepatocyte growth factor receptor (c-MET) MET Met proto-oncogene (hepatocyte growth factor receptor) Tyrosine-protein kinase Met (c-Met) c-Met kinase
Type:
Protein
Mol. Mass.:
155559.73
Organism:
Homo sapiens (Human)
Description:
P08581
Residue:
1390
  
Inhibitor
Name:
BDBM50182519
Synonyms:
CHEMBL3818738 | US9512121, 18
Type:
Small organic molecule
Emp. Form.:
C21H15N7O2S
Mol. Mass.:
429.455
SMILES:
Cn1cc(cn1)-c1ccc2nnc(Sc3ccc4ncc5NC(=O)COc5c4c3)n2c1
: