Target
Macrophage-stimulating protein receptor
Ligand
BDBM50182493
Substrate
Meas. Tech.
ChEBML_1586054
IC50
>30000±n/a nM
Citation
 Zhao, JFang, LZhang, XLiang, YGou, S Synthesis and biological evaluation of new [1,2,4]triazolo[4,3-a]pyridine derivatives as potential c-Met inhibitors. Bioorg Med Chem 24:3483-93 (2016)  
Target
Name:
Macrophage-stimulating protein receptor
Synonyms:
2.7.10.1 CDw136 MST1R Macrophage-stimulating protein receptor alpha chain PTK8 RON Tyrosine kinase receptor ron | p185-Ron
Type:
Protein
Mol. Mass.:
152270.76
Organism:
Homo sapiens (Human)
Description:
Q04912
Residue:
1400
  
Inhibitor
Name:
BDBM50182493
Synonyms:
CHEMBL3818247 | US9512121, 22
Type:
Small organic molecule
Emp. Form.:
C22H16FN7O2S
Mol. Mass.:
461.472
SMILES:
CN1C(=O)COc2c1cnc1ccc(Sc3nnc4c(F)cc(cn34)-c3cnn(C)c3)cc21
: