Target
D(2) dopamine receptor
Ligand
BDBM50182751
Substrate
Meas. Tech.
ChEMBL_1586513 (CHEMBL3821452)
Ki
1150±n/a nM
Citation
 Ofori, EZhu, XYEtukala, JRPeprah, KJordan, KRAdkins, AABricker, BAKang, HJHuang, XPRoth, BLAblordeppey, SY Design and synthesis of dual 5-HT1A and 5-HT7 receptor ligands. Bioorg Med Chem 24:3464-71 (2016)  
Target
Name:
D(2) dopamine receptor
Synonyms:
D(2) dopamine receptor DOPAMINE D2 Long DRD2 Dopamine D2 receptor Dopamine D2 receptor (D2R) Dopamine2-like | d2
Type:
Cell-surface receptors
Mol. Mass.:
50647.10
Organism:
Homo sapiens (Human)
Description:
P14416
Residue:
443
  
Inhibitor
Name:
BDBM50182751
Synonyms:
CHEMBL3819082
Type:
Small organic molecule
Emp. Form.:
C20H23ClFN
Mol. Mass.:
331.855
SMILES:
Cl.Fc1ccc2CC(CCN3CCc4ccccc4C3)Cc2c1
: