Target
5-hydroxytryptamine receptor 1A
Ligand
BDBM50182751
Substrate
Meas. Tech.
ChEMBL_1586508 (CHEMBL3821447)
Ki
193±n/a nM
Citation
 Ofori, EZhu, XYEtukala, JRPeprah, KJordan, KRAdkins, AABricker, BAKang, HJHuang, XPRoth, BLAblordeppey, SY Design and synthesis of dual 5-HT1A and 5-HT7 receptor ligands. Bioorg Med Chem 24:3464-71 (2016)  
Target
Name:
5-hydroxytryptamine receptor 1A
Synonyms:
5-HT-1A 5-hydroxytryptamine receptor 1A (5-HT-1A) ADRB2RL1 Dopamine D2 receptor and serotonin 1a receptor HTR1A | Serotonin receptor 1A
Type:
Mol. Mass.:
46122.49
Organism:
Homo sapiens (Human)
Description:
Residue:
422
  
Inhibitor
Name:
BDBM50182751
Synonyms:
CHEMBL3819082
Type:
Small organic molecule
Emp. Form.:
C20H23ClFN
Mol. Mass.:
331.855
SMILES:
Cl.Fc1ccc2CC(CCN3CCc4ccccc4C3)Cc2c1
: